{"text_format":"1","workbook":"xlsx","n_sheets":8,"sheets":["使い方","照明灯台帳 別紙8-1","分電盤台帳 別紙8-2","照明灯 別紙３-1","照明灯 別紙３-２","分電盤 別紙５-1","分電盤 別紙５-2","照明灯一覧 別紙７"],"not_rendered":{"charts":0,"images":0,"macros":1,"external_links":0,"defined_names":10,"comments":2,"pivot_tables":0},"unopened":[],"bounds":{"document_bytes":16777216,"sheet_cells":100000,"rows_first":2000,"rows_last":500,"rows_between":2000,"halvings":0,"cell_chars":16384,"cell_head_chars":4096},"cells_cut":0,"cells_raw":0,"read":"whole","date_system":"1900"}

{"sheet":"使い方","index":0,"n_rows":21,"n_cols":6,"rows_kept":21,"cut":false,"hidden":false,"merged":[[1,3,1,10]]}
[]
[null,null,null,"このブック（引継用様式データ）の使い方　"]
[null,null,null,null,"（このブックには、データの不要な変更を防ぐため、ロックされているシートがあります）"]
[]
[null,null,"①　別紙8-1のデータを入力する。"]
[null,null,null,"行が足りない場合は、行挿入する。（シートの保護の解除※が必要）"]
[null,"　",null,null,null,"　　　※　校閲タブ→　シート保護の解除　解除パスワードは「3011」です。"]
[]
[null,null,"②　別紙3-2を作成する。　"]
[null,null,null,"引き継ぐ施設毎の作成が必要です。"]
{"$rows_left_out":12}
{"sheet":"照明灯台帳 別紙8-1","index":1,"n_rows":56,"n_cols":61,"rows_kept":56,"cut":false,"hidden":false,"merged":[[1,52,1,55],[34,52,34,55],[51,2,51,3],[33,12,33,13]]}
[null,null,null,null,null,"別表７",null,"別表９",null,null,null,null,null,null,null,null,null,null,null,null,null,"別表２","別表11",null,null,null,null,null,null,"別表10","別表１","別表８",null,null,null,"別表13","別表14","別表15","別表16",null,null,null,null,null,"別表３","別表４","別表５","別表６",null,null,null,"別表17"]
["年度\n官民\n番号","整理番号","年度","事業\n区分","事業名","原因","文書\n番号","維持担当\n事務所","引継の相手方","引継\n年月日","寄付の\n相手方","寄付\n年月日","整理\n番号","管理\n番号","路線名","交差点名","区名","町名","丁目","番地","家名\n目標物","照明区分","灯種区分","容量\n1","灯数1","容量2","灯数2","容量3","灯数3","料金\n区分","施設\n区分","照明灯\n形体","連続\n照明時\n灯数","連続\n照明時\n番号","分電盤\n番号","設置\n区分\n目的","独立柱\n材質","独立柱\n形体","添架\n電柱","引込電柱番号","灯具","使用\n電圧","安定器又は制御装置の種類","灯柱","照明柱\n塗装種別","照明柱\n設置箇所","照明柱\n地際部\n状況","照明柱\n基礎種別","設置\n年月日","移設\n年月日","廃灯\n年月日","関電営業所","門標番号",null,null,null,"集約\n番号","電気業者名","緯度","経度","備考"]
[null,{"$f":"IF(M3=\"\",\"\",M3)","v":1},2022,"民間","（仮称）〇〇○○開発（３工区）","引継",null,"中部建設","（株）〇〇○○神戸支社",null,null,null,1,"6-6601","〇〇28号線","加納町６丁目","中央区","加納町","6丁目","5-1",null,"防犯灯","LED灯","9.2VA",1,null,null,null,null,"定額","独立","単独",null,null,null,"道路","鉄柱","I型",null,"ｶﾉｳﾁｮｳ5E3S1W2","NNY20343LE1",100,null,"防犯灯 H=5.5m","亜鉛メッキ","車道","As舗装","側溝埋設型","2022-10-10",null,null,"神戸営業所","03","45","1234","567890",null,"〇〇電気(有)","34.87654321","135.87654321","ﾎﾟｰﾙ名称,型式○○"]
[null,{"$f":"IF(M4=\"\",\"\",M4)","v":2},2023,"公共","〇〇土地区画整理","引継",null,"中部建設","〇〇公社",null,null,null,2,"6-6602","〇〇29号線",null,"中央区","加納町","7丁目","5-2",null,"防犯灯","LED灯","18.6VA",1,null,null,null,null,"定額","添架","連続",7,1,"10-100","道路",null,null,"関電柱","ｶﾉｳﾁｮｳ5E4","NNY20383LE7",100,null,null,null,null,null,null,"2022-10-11",null,null,"神戸営業所","03","45","1234","567891",null,"〇〇電気(有)","34.87654322","135.87654322","ｶｯﾄﾙｰﾊﾞ付"]
[null,{"$f":"IF(M5=\"\",\"\",M5)","v":""}]
[null,{"$f":"IF(M6=\"\",\"\",M6)","v":""}]
[null,""]
[null,""]
[null,""]
[null,""]
{"$rows_left_out":47}
{"sheet":"分電盤台帳 別紙8-2","index":2,"n_rows":43,"n_cols":49,"rows_kept":43,"cut":false,"hidden":false,"merged":[[1,40,1,43]]}
[null,null,null,null,null,null,"別表５",null,"別表６",null,null,null,null,null,null,null,null,null,null,null,null,null,"別表７","別表１",null,null,null,null,null,null,null,null,null,"別表２","別表３","別表４",null,null,null,"別表８"]
["年度\n官民\n番号","整理\n番号","分電盤\n番号","年度","事業\n区分","事業名","原因","文書番号","維持担当\n事務所","路線名","交差点名","区名","町名","丁目","番地","家名\n目標物","引継\n年月日","引継の相手方","寄付の\n相手方","寄付\n年月日","分電盤\nメータ番号","電力引込\n電柱番号","料金\n区分","施設\n区分","分電盤\n形式","メーカー名","製造番号","製造\n年月","定格\n電圧","定格\n電流","相線式\nφ","相線式\nW","分電盤\n塗装種別","分電盤\n設置\n箇所","分電盤\n地際部\n状況","分電盤\n基礎種別","設置\n年月日","移設\n年月日","廃灯\n年月日","関電営業所","門標番号",null,null,null,"集約\n番号","電気業者名","緯度","経度","備考"]
[null,1,"00-100",2022,"民間","（仮称）〇〇開発","引継",null,"中部建設","〇〇28号線",null,"中央区","加納町","６丁目","5-1",null,null,"（株）〇〇開発",null,null,12345,"ｶﾉｳﾁｮｳ６","従量","独立","〇〇-1","□□電気設備","E-123","2022/3","200/100",50,1,3,"塗装","歩道","As舗装","舗装埋設型","2022-04-01",null,null,"神戸営業所","03","45","1234","567890",null,"(有)〇〇電気",34.123456779999998,135.12345678,"○○交番前"]
[null,2,"00-101",2023,"民間","（仮称）〇〇開発","引継",null,"中部建設","〇〇29号線","加納町６丁目","中央区","加納町","６丁目","5-2",null,null,"（株）〇〇開発",null,null,12345,"ｶﾉｳﾁｮｳ７","従量","添架","〇〇-2","〇〇システム","E-124","2022/4","200/100",50,1,3,"塗装",null,null,null,"2022-04-01",null,null,"神戸営業所","03","45","1234","567891",null,"(有)〇〇電気"]
[]
[]
[]
[]
[]
[]
{"$rows_left_out":34}
{"sheet":"照明灯 別紙３-1","index":3,"n_rows":22,"n_cols":31,"rows_kept":22,"cut":false,"hidden":false,"merged":[[14,7,15,12],[18,4,18,5],[14,20,14,21],[14,18,14,19],[14,13,14,14],[16,8,21,8],[14,1,15,4],[16,1,17,3],[18,1,19,3],[20,1,21,3],[17,4,17,7],[19,4,19,7],[21,4,21,7],[15,13,15,15],[15,18,15,19],[16,13,16,14],[4,1,5,4],[4,5,4,9],[4,10,4,16],[4,17,7,17],[4,18,5,21],[6,1,7,4],[6,5,6,9],[6,10,6,16],[6,18,7,21],[7,10,7,16],[5,14,5,16],[5,12,5,13],[5,6,5,7],[7,6,7,7],[8,1,9,4],[8,7,9,7],[8,10,9,10],[8,11,9,13],[8,14,9,16],[12,1,13,4],[12,5,13,7],[12,8,13,12],[10,1,11,4],[10,5,11,7],[10,8,11,10],[10,11,11,13],[12,13,12,14],[2,1,3,1],[2,2,3,2],[2,3,3,3],[2,13,2,14],[2,5,2,6],[2,7,2,12],[3,5,3,7],[3,8,3,9],[3,11,3,12],[1,15,1,18],[1,19,1,21],[3,13,3,14],[3,15,3,21],[2,15,2,21],[8,17,9,21],[10,17,11,21],[10,14,11,16],[13,18,13,19],[13,20,13,21],[16,15,16,21],[15,20,15,21],[12,15,12,21],[13,13,13,14],[17,14,21,21]]}
[]
[null,"照明灯台帳（個表）",null,null,null,null,null,null,null,null,null,null,null,null,null,"整理番号",null,null,null,{"$f":"IF(ISBLANK(VLOOKUP($Z$2,'照明灯台帳 別紙8-1'!$B$3:$BI$32,12)),\"\",VLOOKUP($Z$2,'照明灯台帳 別紙8-1'!$B$3:$BI$32,12))","v":2},null,null,null,null,"整理番号",2,null,"印刷範囲",1,"～",2]
[null,"年　度",{"$f":"IF(ISBLANK(VLOOKUP($Z$2,'照明灯台帳 別紙8-1'!$B$3:$BI$32,2)),\"\",VLOOKUP($Z$2,'照明灯台帳 別紙8-1'!$B$3:$BI$32,2))","v":2023},"区　分",{"$f":"IF(ISBLANK(VLOOKUP($Z$2,'照明灯台帳 別紙8-1'!$B$3:$BI$32,5)),\"\",VLOOKUP($Z$2,'照明灯台帳 別紙8-1'!$B$3:$BI$32,5))","v":"引継"},"事業名",null,{"$f":"IF(ISBLANK(VLOOKUP($Z$2,'照明灯台帳 別紙8-1'!$B$3:$BI$32,4)),\"\",VLOOKUP($Z$2,'照明灯台帳 別紙8-1'!$B$3:$BI$32,4))","v":"〇〇土地区画整理"},null,null,null,null,null,"維持担当事務所",null,{"$f":"IF(ISBLANK(VLOOKUP($Z$2,'照明灯台帳 別紙8-1'!$B$3:$BI$32,7)),\"\",VLOOKUP($Z$2,'照明灯台帳 別紙8-1'!$B$3:$BI$32,7))","v":"中部建設"}]
[null,null,null,null,{"$f":"IF(ISBLANK(VLOOKUP($Z$2,'照明灯台帳 別紙8-1'!$B$3:$BI$32,31)),\"\",VLOOKUP($Z$2,'照明灯台帳 別紙8-1'!$B$3:$BI$32,31))","v":"連続"},"　連続の場合",null,null,{"$f":"IF(ISBLANK(VLOOKUP($Z$2,'照明灯台帳 別紙8-1'!$B$3:$BI$32,32)),\"\",VLOOKUP($Z$2,'照明灯台帳 別紙8-1'!$B$3:$BI$32,32))","v":7},null,"灯のうち　No",{"$f":"IF(ISBLANK(VLOOKUP($Z$2,'照明灯台帳 別紙8-1'!$B$3:$BI$32,33)),\"\",VLOOKUP($Z$2,'照明灯台帳 別紙8-1'!$B$3:$BI$32,33))","v":1},null,"分電盤番号",null,{"$f":"IF(ISBLANK(VLOOKUP($Z$2,'照明灯台帳 別紙8-1'!$B$3:$BI$32,34)),\"\",VLOOKUP($Z$2,'照明灯台帳 別紙8-1'!$B$3:$BI$32,34))","v":"10-100"}]
[null,"路　　　線　　　名",null,null,null,{"$f":"IF(ISBLANK(VLOOKUP($Z$2,'照明灯台帳 別紙8-1'!$B$3:$BI$32,14)),\"\",VLOOKUP($Z$2,'照明灯台帳 別紙8-1'!$B$3:$BI$32,14))","v":"〇〇29号線"},null,null,null,null,"　設置場所（住居表示）",null,null,null,null,null,null,"管理番号",{"$f":"IF(ISBLANK(VLOOKUP($Z$2,'照明灯台帳 別紙8-1'!$B$3:$BI$32,13)),\"\",VLOOKUP($Z$2,'照明灯台帳 別紙8-1'!$B$3:$BI$32,13))","v":"6-6602"}]
[null,null,null,null,null,"（",{"$f":"IF(ISBLANK(VLOOKUP($Z$2,'照明灯台帳 別紙8-1'!$B$3:$BI$32,15)),\"\",VLOOKUP($Z$2,'照明灯台帳 別紙8-1'!$B$3:$BI$32,15))","v":""},null,null,"交差点）　",{"$f":"IF(ISBLANK(VLOOKUP($Z$2,'照明灯台帳 別紙8-1'!$B$3:$BI$32,16)),\"\",VLOOKUP($Z$2,'照明灯台帳 別紙8-1'!$B$3:$BI$32,16))","v":"中央区"},{"$f":"IF(ISBLANK(VLOOKUP($Z$2,'照明灯台帳 別紙8-1'!$B$3:$BI$32,17)),\"\",VLOOKUP($Z$2,'照明灯台帳 別紙8-1'!$B$3:$BI$32,17))","v":"加納町"},{"$f":"IF(ISBLANK(VLOOKUP($Z$2,'照明灯台帳 別紙8-1'!$B$3:$BI$32,18)),\"\",VLOOKUP($Z$2,'照明灯台帳 別紙8-1'!$B$3:$BI$32,18))","v":"7丁目"},null,{"$f":"IF(ISBLANK(VLOOKUP($Z$2,'照明灯台帳 別紙8-1'!$B$3:$BI$32,19)),\"\",VLOOKUP($Z$2,'照明灯台帳 別紙8-1'!$B$3:$BI$32,19))","v":"5-2"}]
[null,"移　　　設　　　先",null,null,null,null,null,null,null,null,"　設置場所（住居表示）"]
[null,null,null,null,null,"（",null,null,null,"交差点）　"]
[null,"設  置  年  月  日",null,null,null,"〇","引継","　年月日","●","引継","　の相手方","移設年月日",null,null,"廃灯年月日",null,null,"定額・メーター別"]
[null,null,null,null,null,"〇","寄贈",null,"〇","寄贈"]
{"$rows_left_out":13}
{"sheet":"照明灯 別紙３-２","index":4,"n_rows":44,"n_cols":22,"rows_kept":44,"cut":false,"hidden":false,"merged":[]}
[]
[null,null,null,null,null,null,null,null,null,null,null,null,null,null,null,null,null,null,null,null,null,"整理番号□□　"]
[]
[]
[]
[]
[]
[]
[]
[]
{"$rows_left_out":35}
{"sheet":"分電盤 別紙５-1","index":5,"n_rows":24,"n_cols":31,"rows_kept":24,"cut":false,"hidden":false,"merged":[[1,15,1,18],[1,19,1,21],[2,1,3,1],[2,2,3,2],[2,3,3,3],[2,4,3,4],[2,5,3,6],[2,7,3,12],[2,13,3,14],[2,15,3,21],[4,1,5,4],[4,5,4,9],[4,10,4,16],[4,17,7,17],[4,18,5,21],[6,1,7,4],[6,5,6,9],[6,10,6,16],[5,12,5,13],[5,14,5,16],[5,6,5,7],[7,6,7,7],[10,17,11,21],[6,18,7,21],[7,10,7,16],[8,1,9,4],[8,7,9,7],[8,10,9,10],[8,11,9,13],[8,14,9,16],[8,17,9,21],[10,1,11,4],[10,5,11,7],[10,8,11,10],[10,11,11,13],[10,14,11,16],[12,1,15,1],[12,2,13,4],[12,13,12,14],[12,15,12,21],[13,13,13,14],[14,2,15,4],[15,13,15,15],[12,6,13,12],[14,6,15,12],[14,18,14,19],[14,20,14,21],[13,18,13,19],[13,20,13,21],[15,18,15,19],[15,20,15,21],[14,13,14,14],[16,1,23,1],[16,2,16,4],[16,13,23,13],[17,2,17,4],[20,2,20,4],[18,2,18,4],[19,2,19,4],[21,2,21,4],[22,2,22,4],[23,2,23,4]]}
[]
[null,"分電盤台帳（個表）",null,null,null,null,null,null,null,null,null,null,null,null,null,"整理番号",null,null,null,{"$f":"IF(ISBLANK(VLOOKUP($Z$2,'分電盤台帳 別紙8-2'!$B$3:$AT$22,1)),\"\",VLOOKUP($Z$2,'分電盤台帳 別紙8-2'!$B$3:$AT$22,1))","v":2},null,null,null,null,"整理番号",2,null,"印刷範囲",1,"～",2]
[null,"年度",{"$f":"IF(ISBLANK(VLOOKUP($Z$2,'分電盤台帳 別紙8-2'!$B$3:$AT$22,3)),\"\",VLOOKUP($Z$2,'分電盤台帳 別紙8-2'!$B$3:$AT$22,3))","v":2023},"区分",{"$f":"IF(ISBLANK(VLOOKUP($Z$2,'分電盤台帳 別紙8-2'!$B$3:$AT$22,6)),\"\",VLOOKUP($Z$2,'分電盤台帳 別紙8-2'!$B$3:$AT$22,6))","v":"引継"},"事業名",null,{"$f":"IF(ISBLANK(VLOOKUP($Z$2,'分電盤台帳 別紙8-2'!$B$3:$AT$22,5)),\"\",VLOOKUP($Z$2,'分電盤台帳 別紙8-2'!$B$3:$AT$22,5))","v":"（仮称）〇〇開発"},null,null,null,null,null,"維持担当事務所",null,{"$f":"IF(ISBLANK(VLOOKUP($Z$2,'分電盤台帳 別紙8-2'!$B$3:$AT$22,8)),\"\",VLOOKUP($Z$2,'分電盤台帳 別紙8-2'!$B$3:$AT$22,8))","v":"中部建設"}]
[]
[null,"路　　　線　　　名",null,null,null,{"$f":"IF(ISBLANK(VLOOKUP($Z$2,'分電盤台帳 別紙8-2'!$B$3:$AT$22,9)),\"\",VLOOKUP($Z$2,'分電盤台帳 別紙8-2'!$B$3:$AT$22,9))","v":"〇〇29号線"},null,null,null,null,"　設置場所（住居表示）",null,null,null,null,null,null,"管理番号",{"$f":"IF(ISBLANK(VLOOKUP($Z$2,'分電盤台帳 別紙8-2'!$B$3:$AT$22,2)),\"\",VLOOKUP($Z$2,'分電盤台帳 別紙8-2'!$B$3:$AT$22,2))","v":"00-101"}]
[null,null,null,null,null,"（",{"$f":"IF(ISBLANK(VLOOKUP($Z$2,'分電盤台帳 別紙8-2'!$B$3:$AT$22,10)),\"\",VLOOKUP($Z$2,'分電盤台帳 別紙8-2'!$B$3:$AT$22,10))","v":"加納町６丁目"},null,null,"交差点）　",{"$f":"IF(ISBLANK(VLOOKUP($Z$2,'分電盤台帳 別紙8-2'!$B$3:$AT$22,11)),\"\",VLOOKUP($Z$2,'分電盤台帳 別紙8-2'!$B$3:$AT$22,11))","v":"中央区"},{"$f":"IF(ISBLANK(VLOOKUP($Z$2,'分電盤台帳 別紙8-2'!$B$3:$AT$22,12)),\"\",VLOOKUP($Z$2,'分電盤台帳 別紙8-2'!$B$3:$AT$22,12))","v":"加納町"},{"$f":"IF(ISBLANK(VLOOKUP($Z$2,'分電盤台帳 別紙8-2'!$B$3:$AT$22,13)),\"\",VLOOKUP($Z$2,'分電盤台帳 別紙8-2'!$B$3:$AT$22,13))","v":"６丁目"},null,{"$f":"IF(ISBLANK(VLOOKUP($Z$2,'分電盤台帳 別紙8-2'!$B$3:$AT$22,14)),\"\",VLOOKUP($Z$2,'分電盤台帳 別紙8-2'!$B$3:$AT$22,14))","v":"5-2"}]
[null,"移　　　設　　　先",null,null,null,null,null,null,null,null,"　設置場所（住居表示）"]
[null,null,null,null,null,"（",null,null,null,"交差点）　"]
[null,"設  置  年  月  日",null,null,null,"〇","引継","　年月日","●","引継","　の相手方","移設年月日",null,null,"廃灯年月日",null,null,"定額・メーター別"]
[null,null,null,null,null,"〇","寄贈",null,"〇","寄贈"]
{"$rows_left_out":15}
{"sheet":"分電盤 別紙５-2","index":6,"n_rows":4,"n_cols":23,"rows_kept":4,"cut":false,"hidden":false,"merged":[]}
[]
[]
[]
[null,null,null,null,null,null,null,null,null,null,null,null,null,null,null,null,null,null,null,null,null,null,"整理番号□□ "]

{"sheet":"照明灯一覧 別紙７","index":7,"n_rows":45,"n_cols":64,"rows_kept":45,"cut":false,"hidden":false,"merged":[[1,52,1,55],[32,12,32,13]]}
[null,null,null,null,null,"別表７",null,"別表９",null,null,null,null,null,null,null,null,null,null,null,null,null,"別表２",null,null,null,null,null,null,null,"別表１０",null,"別表８",null,null,null,"別表１３","別表１４","別表１５","別表１６",null,null,null,null,null,"別表３","別表４","別表５","別表６"]
[null,"年度\n官民\n番号","年度","事業\n区分","事業名","原因","文書\n番号","維持担当\n事務所","引継の\n相手方","引継\n年月日","寄付の\n相手方","寄付\n年月日","整理\n番号","管理\n番号","路線名","交差点名","区名","町名","丁目","番地","家名\n目標物","照明区分","灯種\n区分","容量","灯数1","容量2","灯数2","容量3","灯数3","料金\n区分","設置\n区分","照明灯\n形体","連続\n照明時\n灯数","連続\n照明時\n番号","分電盤番号","設置区分\n目的","独立柱\n材質","独立柱\n形体","添架電柱","引込電柱番号","灯具","使用\n電圧","安定器又は\n制御装置の\n種類","灯柱","照明柱\n塗装種別","照明柱\n設置箇所","照明柱\n地際部状況","照明柱\n基礎種別","設置\n年月日","移設\n年月日","廃灯\n年月日","関電営業所","門標番号",null,null,null,"集約\n番号","電気業者名","緯度","経度","備考",null,null,"※別紙８のデータを参照しています"]
[null,null,2022,"民間","〇〇開発","引継",null,"西建設","（株）〇〇",null,null,null,{"$f":"'照明灯台帳 別紙8-1'!M3","v":1},{"$f":"'照明灯台帳 別紙8-1'!N3","v":"6-6601"},{"$f":"'照明灯台帳 別紙8-1'!O3","v":"〇〇28号線"},null,{"$f":"'照明灯台帳 別紙8-1'!Q3","v":"中央区"},{"$f":"'照明灯台帳 別紙8-1'!R3","v":"加納町"},{"$f":"'照明灯台帳 別紙8-1'!S3","v":"6丁目"},{"$f":"'照明灯台帳 別紙8-1'!T3","v":"5-1"},null,"防犯灯",{"$f":"'照明灯台帳 別紙8-1'!W3","v":"LED灯"},{"$f":"'照明灯台帳 別紙8-1'!X3","v":"9.2VA"},1,null,null,null,null,"定額",{"$f":"'照明灯台帳 別紙8-1'!AE3","v":"独立"},"単独",null,null,null,"道路","鉄柱","I型",null,{"$f":"'照明灯台帳 別紙8-1'!AN3","v":"ｶﾉｳﾁｮｳ5E3S1W2"},null,100,null,"防犯灯（H=5.5m）","亜鉛メッキ","車道","As舗装","舗装埋設型","2022-10-10",null,null,{"$f":"'照明灯台帳 別紙8-1'!AZ3","v":"神戸営業所"},{"$f":"'照明灯台帳 別紙8-1'!BA3","v":"03"},{"$f":"'照明灯台帳 別紙8-1'!BB3","v":"45"},{"$f":"'照明灯台帳 別紙8-1'!BC3","v":"1234"},{"$f":"'照明灯台帳 別紙8-1'!BD3","v":"567890"},null,"〇〇電気(有)",null,null,{"$f":"'照明灯台帳 別紙8-1'!BI3","v":"ﾎﾟｰﾙ名称,型式○○"}]
[null,null,null,null,null,null,null,null,null,null,null,null,{"$f":"'照明灯台帳 別紙8-1'!M4","v":2},{"$f":"'照明灯台帳 別紙8-1'!N4","v":"6-6602"},{"$f":"'照明灯台帳 別紙8-1'!O4","v":"〇〇29号線"},{"$f":"'照明灯台帳 別紙8-1'!P4","v":0},{"$f":"'照明灯台帳 別紙8-1'!Q4","v":"中央区"},{"$f":"'照明灯台帳 別紙8-1'!R4","v":"加納町"},{"$f":"'照明灯台帳 別紙8-1'!S4","v":"7丁目"},{"$f":"'照明灯台帳 別紙8-1'!T4","v":"5-2"},{"$f":"'照明灯台帳 別紙8-1'!U4","v":0},{"$f":"'照明灯台帳 別紙8-1'!V4","v":"防犯灯"},{"$f":"'照明灯台帳 別紙8-1'!W4","v":"LED灯"},{"$f":"'照明灯台帳 別紙8-1'!X4","v":"18.6VA"},{"$f":"'照明灯台帳 別紙8-1'!Y4","v":1},{"$f":"'照明灯台帳 別紙8-1'!Z4","v":0},{"$f":"'照明灯台帳 別紙8-1'!AA4","v":0},{"$f":"'照明灯台帳 別紙8-1'!AB4","v":0},{"$f":"'照明灯台帳 別紙8-1'!AC4","v":0},{"$f":"'照明灯台帳 別紙8-1'!AD4","v":"定額"},{"$f":"'照明灯台帳 別紙8-1'!AE4","v":"添架"},{"$f":"'照明灯台帳 別紙8-1'!AF4","v":"連続"},{"$f":"'照明灯台帳 別紙8-1'!AG4","v":7},{"$f":"'照明灯台帳 別紙8-1'!AH4","v":1},{"$f":"'照明灯台帳 別紙8-1'!AI4","v":"10-100"},{"$f":"'照明灯台帳 別紙8-1'!AJ4","v":"道路"},{"$f":"'照明灯台帳 別紙8-1'!AK4","v":0},{"$f":"'照明灯台帳 別紙8-1'!AL4","v":0},{"$f":"'照明灯台帳 別紙8-1'!AM4","v":"関電柱"},{"$f":"'照明灯台帳 別紙8-1'!AN4","v":"ｶﾉｳﾁｮｳ5E4"},{"$f":"'照明灯台帳 別紙8-1'!AO4","v":"NNY20383LE7"},{"$f":"'照明灯台帳 別紙8-1'!AP4","v":100},{"$f":"'照明灯台帳 別紙8-1'!AQ4","v":0},{"$f":"'照明灯台帳 別紙8-1'!AR4","v":0},{"$f":"'照明灯台帳 別紙8-1'!AS4","v":0},{"$f":"'照明灯台帳 別紙8-1'!AT4","v":0},{"$f":"'照明灯台帳 別紙8-1'!AU4","v":0},{"$f":"'照明灯台帳 別紙8-1'!AV4","v":0},{"$f":"'照明灯台帳 別紙8-1'!AW4","v":44845},{"$f":"'照明灯台帳 別紙8-1'!AX4","v":0},{"$f":"'照明灯台帳 別紙8-1'!AY4","v":0},{"$f":"'照明灯台帳 別紙8-1'!AZ4","v":"神戸営業所"},{"$f":"'照明灯台帳 別紙8-1'!BA4","v":"03"},{"$f":"'照明灯台帳 別紙8-1'!BB4","v":"45"},{"$f":"'照明灯台帳 別紙8-1'!BC4","v":"1234"},{"$f":"'照明灯台帳 別紙8-1'!BD4","v":"567891"},null,null,null,null,{"$f":"'照明灯台帳 別紙8-1'!BI4","v":"ｶｯﾄﾙｰﾊﾞ付"}]
[null,null,null,null,null,null,null,null,null,null,null,null,{"$f":"'照明灯台帳 別紙8-1'!M5","v":0},{"$f":"'照明灯台帳 別紙8-1'!N5","v":0},{"$f":"'照明灯台帳 別紙8-1'!O5","v":0},{"$f":"'照明灯台帳 別紙8-1'!P5","v":0},{"$f":"'照明灯台帳 別紙8-1'!Q5","v":0},{"$f":"'照明灯台帳 別紙8-1'!R5","v":0},{"$f":"'照明灯台帳 別紙8-1'!S5","v":0},{"$f":"'照明灯台帳 別紙8-1'!T5","v":0},{"$f":"'照明灯台帳 別紙8-1'!U5","v":0},{"$f":"'照明灯台帳 別紙8-1'!V5","v":0},{"$f":"'照明灯台帳 別紙8-1'!W5","v":0},{"$f":"'照明灯台帳 別紙8-1'!X5","v":0},{"$f":"'照明灯台帳 別紙8-1'!Y5","v":0},{"$f":"'照明灯台帳 別紙8-1'!Z5","v":0},{"$f":"'照明灯台帳 別紙8-1'!AA5","v":0},{"$f":"'照明灯台帳 別紙8-1'!AB5","v":0},{"$f":"'照明灯台帳 別紙8-1'!AC5","v":0},{"$f":"'照明灯台帳 別紙8-1'!AD5","v":0},{"$f":"'照明灯台帳 別紙8-1'!AE5","v":0},{"$f":"'照明灯台帳 別紙8-1'!AF5","v":0},{"$f":"'照明灯台帳 別紙8-1'!AG5","v":0},{"$f":"'照明灯台帳 別紙8-1'!AH5","v":0},{"$f":"'照明灯台帳 別紙8-1'!AI5","v":0},{"$f":"'照明灯台帳 別紙8-1'!AJ5","v":0},{"$f":"'照明灯台帳 別紙8-1'!AK5","v":0},{"$f":"'照明灯台帳 別紙8-1'!AL5","v":0},{"$f":"'照明灯台帳 別紙8-1'!AM5","v":0},{"$f":"'照明灯台帳 別紙8-1'!AN5","v":0},{"$f":"'照明灯台帳 別紙8-1'!AO5","v":0},{"$f":"'照明灯台帳 別紙8-1'!AP5","v":0},{"$f":"'照明灯台帳 別紙8-1'!AQ5","v":0},{"$f":"'照明灯台帳 別紙8-1'!AR5","v":0},{"$f":"'照明灯台帳 別紙8-1'!AS5","v":0},{"$f":"'照明灯台帳 別紙8-1'!AT5","v":0},{"$f":"'照明灯台帳 別紙8-1'!AU5","v":0},{"$f":"'照明灯台帳 別紙8-1'!AV5","v":0},{"$f":"'照明灯台帳 別紙8-1'!AW5","v":0},{"$f":"'照明灯台帳 別紙8-1'!AX5","v":0},{"$f":"'照明灯台帳 別紙8-1'!AY5","v":0},{"$f":"'照明灯台帳 別紙8-1'!AZ5","v":0},{"$f":"'照明灯台帳 別紙8-1'!BA5","v":0},{"$f":"'照明灯台帳 別紙8-1'!BB5","v":0},{"$f":"'照明灯台帳 別紙8-1'!BC5","v":0},{"$f":"'照明灯台帳 別紙8-1'!BD5","v":0},null,null,null,null,{"$f":"'照明灯台帳 別紙8-1'!BI5","v":0}]
[null,null,null,null,null,null,null,null,null,null,null,null,{"$f":"'照明灯台帳 別紙8-1'!M6","v":0},{"$f":"'照明灯台帳 別紙8-1'!N6","v":0},{"$f":"'照明灯台帳 別紙8-1'!O6","v":0},{"$f":"'照明灯台帳 別紙8-1'!P6","v":0},{"$f":"'照明灯台帳 別紙8-1'!Q6","v":0},{"$f":"'照明灯台帳 別紙8-1'!R6","v":0},{"$f":"'照明灯台帳 別紙8-1'!S6","v":0},{"$f":"'照明灯台帳 別紙8-1'!T6","v":0},{"$f":"'照明灯台帳 別紙8-1'!U6","v":0},{"$f":"'照明灯台帳 別紙8-1'!V6","v":0},{"$f":"'照明灯台帳 別紙8-1'!W6","v":0},{"$f":"'照明灯台帳 別紙8-1'!X6","v":0},{"$f":"'照明灯台帳 別紙8-1'!Y6","v":0},{"$f":"'照明灯台帳 別紙8-1'!Z6","v":0},{"$f":"'照明灯台帳 別紙8-1'!AA6","v":0},{"$f":"'照明灯台帳 別紙8-1'!AB6","v":0},{"$f":"'照明灯台帳 別紙8-1'!AC6","v":0},{"$f":"'照明灯台帳 別紙8-1'!AD6","v":0},{"$f":"'照明灯台帳 別紙8-1'!AE6","v":0},{"$f":"'照明灯台帳 別紙8-1'!AF6","v":0},{"$f":"'照明灯台帳 別紙8-1'!AG6","v":0},{"$f":"'照明灯台帳 別紙8-1'!AH6","v":0},{"$f":"'照明灯台帳 別紙8-1'!AI6","v":0},{"$f":"'照明灯台帳 別紙8-1'!AJ6","v":0},{"$f":"'照明灯台帳 別紙8-1'!AK6","v":0},{"$f":"'照明灯台帳 別紙8-1'!AL6","v":0},{"$f":"'照明灯台帳 別紙8-1'!AM6","v":0},{"$f":"'照明灯台帳 別紙8-1'!AN6","v":0},{"$f":"'照明灯台帳 別紙8-1'!AO6","v":0},{"$f":"'照明灯台帳 別紙8-1'!AP6","v":0},{"$f":"'照明灯台帳 別紙8-1'!AQ6","v":0},{"$f":"'照明灯台帳 別紙8-1'!AR6","v":0},{"$f":"'照明灯台帳 別紙8-1'!AS6","v":0},{"$f":"'照明灯台帳 別紙8-1'!AT6","v":0},{"$f":"'照明灯台帳 別紙8-1'!AU6","v":0},{"$f":"'照明灯台帳 別紙8-1'!AV6","v":0},{"$f":"'照明灯台帳 別紙8-1'!AW6","v":0},{"$f":"'照明灯台帳 別紙8-1'!AX6","v":0},{"$f":"'照明灯台帳 別紙8-1'!AY6","v":0},{"$f":"'照明灯台帳 別紙8-1'!AZ6","v":0},{"$f":"'照明灯台帳 別紙8-1'!BA6","v":0},{"$f":"'照明灯台帳 別紙8-1'!BB6","v":0},{"$f":"'照明灯台帳 別紙8-1'!BC6","v":0},{"$f":"'照明灯台帳 別紙8-1'!BD6","v":0},null,null,null,null,{"$f":"'照明灯台帳 別紙8-1'!BI6","v":0}]
[null,null,null,null,null,null,null,null,null,null,null,null,{"$f":"'照明灯台帳 別紙8-1'!M7","v":0},{"$f":"'照明灯台帳 別紙8-1'!N7","v":0},{"$f":"'照明灯台帳 別紙8-1'!O7","v":0},{"$f":"'照明灯台帳 別紙8-1'!P7","v":0},{"$f":"'照明灯台帳 別紙8-1'!Q7","v":0},{"$f":"'照明灯台帳 別紙8-1'!R7","v":0},{"$f":"'照明灯台帳 別紙8-1'!S7","v":0},{"$f":"'照明灯台帳 別紙8-1'!T7","v":0},{"$f":"'照明灯台帳 別紙8-1'!U7","v":0},{"$f":"'照明灯台帳 別紙8-1'!V7","v":0},{"$f":"'照明灯台帳 別紙8-1'!W7","v":0},{"$f":"'照明灯台帳 別紙8-1'!X7","v":0},{"$f":"'照明灯台帳 別紙8-1'!Y7","v":0},{"$f":"'照明灯台帳 別紙8-1'!Z7","v":0},{"$f":"'照明灯台帳 別紙8-1'!AA7","v":0},{"$f":"'照明灯台帳 別紙8-1'!AB7","v":0},{"$f":"'照明灯台帳 別紙8-1'!AC7","v":0},{"$f":"'照明灯台帳 別紙8-1'!AD7","v":0},{"$f":"'照明灯台帳 別紙8-1'!AE7","v":0},{"$f":"'照明灯台帳 別紙8-1'!AF7","v":0},{"$f":"'照明灯台帳 別紙8-1'!AG7","v":0},{"$f":"'照明灯台帳 別紙8-1'!AH7","v":0},{"$f":"'照明灯台帳 別紙8-1'!AI7","v":0},{"$f":"'照明灯台帳 別紙8-1'!AJ7","v":0},{"$f":"'照明灯台帳 別紙8-1'!AK7","v":0},{"$f":"'照明灯台帳 別紙8-1'!AL7","v":0},{"$f":"'照明灯台帳 別紙8-1'!AM7","v":0},{"$f":"'照明灯台帳 別紙8-1'!AN7","v":0},{"$f":"'照明灯台帳 別紙8-1'!AO7","v":0},{"$f":"'照明灯台帳 別紙8-1'!AP7","v":0},{"$f":"'照明灯台帳 別紙8-1'!AQ7","v":0},{"$f":"'照明灯台帳 別紙8-1'!AR7","v":0},{"$f":"'照明灯台帳 別紙8-1'!AS7","v":0},{"$f":"'照明灯台帳 別紙8-1'!AT7","v":0},{"$f":"'照明灯台帳 別紙8-1'!AU7","v":0},{"$f":"'照明灯台帳 別紙8-1'!AV7","v":0},{"$f":"'照明灯台帳 別紙8-1'!AW7","v":0},{"$f":"'照明灯台帳 別紙8-1'!AX7","v":0},{"$f":"'照明灯台帳 別紙8-1'!AY7","v":0},{"$f":"'照明灯台帳 別紙8-1'!AZ7","v":0},{"$f":"'照明灯台帳 別紙8-1'!BA7","v":0},{"$f":"'照明灯台帳 別紙8-1'!BB7","v":0},{"$f":"'照明灯台帳 別紙8-1'!BC7","v":0},{"$f":"'照明灯台帳 別紙8-1'!BD7","v":0},null,null,null,null,{"$f":"'照明灯台帳 別紙8-1'!BI7","v":0}]
[null,null,null,null,null,null,null,null,null,null,null,null,{"$f":"'照明灯台帳 別紙8-1'!M8","v":0},{"$f":"'照明灯台帳 別紙8-1'!N8","v":0},{"$f":"'照明灯台帳 別紙8-1'!O8","v":0},{"$f":"'照明灯台帳 別紙8-1'!P8","v":0},{"$f":"'照明灯台帳 別紙8-1'!Q8","v":0},{"$f":"'照明灯台帳 別紙8-1'!R8","v":0},{"$f":"'照明灯台帳 別紙8-1'!S8","v":0},{"$f":"'照明灯台帳 別紙8-1'!T8","v":0},{"$f":"'照明灯台帳 別紙8-1'!U8","v":0},{"$f":"'照明灯台帳 別紙8-1'!V8","v":0},{"$f":"'照明灯台帳 別紙8-1'!W8","v":0},{"$f":"'照明灯台帳 別紙8-1'!X8","v":0},{"$f":"'照明灯台帳 別紙8-1'!Y8","v":0},{"$f":"'照明灯台帳 別紙8-1'!Z8","v":0},{"$f":"'照明灯台帳 別紙8-1'!AA8","v":0},{"$f":"'照明灯台帳 別紙8-1'!AB8","v":0},{"$f":"'照明灯台帳 別紙8-1'!AC8","v":0},{"$f":"'照明灯台帳 別紙8-1'!AD8","v":0},{"$f":"'照明灯台帳 別紙8-1'!AE8","v":0},{"$f":"'照明灯台帳 別紙8-1'!AF8","v":0},{"$f":"'照明灯台帳 別紙8-1'!AG8","v":0},{"$f":"'照明灯台帳 別紙8-1'!AH8","v":0},{"$f":"'照明灯台帳 別紙8-1'!AI8","v":0},{"$f":"'照明灯台帳 別紙8-1'!AJ8","v":0},{"$f":"'照明灯台帳 別紙8-1'!AK8","v":0},{"$f":"'照明灯台帳 別紙8-1'!AL8","v":0},{"$f":"'照明灯台帳 別紙8-1'!AM8","v":0},{"$f":"'照明灯台帳 別紙8-1'!AN8","v":0},{"$f":"'照明灯台帳 別紙8-1'!AO8","v":0},{"$f":"'照明灯台帳 別紙8-1'!AP8","v":0},{"$f":"'照明灯台帳 別紙8-1'!AQ8","v":0},{"$f":"'照明灯台帳 別紙8-1'!AR8","v":0},{"$f":"'照明灯台帳 別紙8-1'!AS8","v":0},{"$f":"'照明灯台帳 別紙8-1'!AT8","v":0},{"$f":"'照明灯台帳 別紙8-1'!AU8","v":0},{"$f":"'照明灯台帳 別紙8-1'!AV8","v":0},{"$f":"'照明灯台帳 別紙8-1'!AW8","v":0},{"$f":"'照明灯台帳 別紙8-1'!AX8","v":0},{"$f":"'照明灯台帳 別紙8-1'!AY8","v":0},{"$f":"'照明灯台帳 別紙8-1'!AZ8","v":0},{"$f":"'照明灯台帳 別紙8-1'!BA8","v":0},{"$f":"'照明灯台帳 別紙8-1'!BB8","v":0},{"$f":"'照明灯台帳 別紙8-1'!BC8","v":0},{"$f":"'照明灯台帳 別紙8-1'!BD8","v":0},null,null,null,null,{"$f":"'照明灯台帳 別紙8-1'!BI8","v":0}]
[null,null,null,null,null,null,null,null,null,null,null,null,{"$f":"'照明灯台帳 別紙8-1'!M9","v":0},{"$f":"'照明灯台帳 別紙8-1'!N9","v":0},{"$f":"'照明灯台帳 別紙8-1'!O9","v":0},{"$f":"'照明灯台帳 別紙8-1'!P9","v":0},{"$f":"'照明灯台帳 別紙8-1'!Q9","v":0},{"$f":"'照明灯台帳 別紙8-1'!R9","v":0},{"$f":"'照明灯台帳 別紙8-1'!S9","v":0},{"$f":"'照明灯台帳 別紙8-1'!T9","v":0},{"$f":"'照明灯台帳 別紙8-1'!U9","v":0},{"$f":"'照明灯台帳 別紙8-1'!V9","v":0},{"$f":"'照明灯台帳 別紙8-1'!W9","v":0},{"$f":"'照明灯台帳 別紙8-1'!X9","v":0},{"$f":"'照明灯台帳 別紙8-1'!Y9","v":0},{"$f":"'照明灯台帳 別紙8-1'!Z9","v":0},{"$f":"'照明灯台帳 別紙8-1'!AA9","v":0},{"$f":"'照明灯台帳 別紙8-1'!AB9","v":0},{"$f":"'照明灯台帳 別紙8-1'!AC9","v":0},{"$f":"'照明灯台帳 別紙8-1'!AD9","v":0},{"$f":"'照明灯台帳 別紙8-1'!AE9","v":0},{"$f":"'照明灯台帳 別紙8-1'!AF9","v":0},{"$f":"'照明灯台帳 別紙8-1'!AG9","v":0},{"$f":"'照明灯台帳 別紙8-1'!AH9","v":0},{"$f":"'照明灯台帳 別紙8-1'!AI9","v":0},{"$f":"'照明灯台帳 別紙8-1'!AJ9","v":0},{"$f":"'照明灯台帳 別紙8-1'!AK9","v":0},{"$f":"'照明灯台帳 別紙8-1'!AL9","v":0},{"$f":"'照明灯台帳 別紙8-1'!AM9","v":0},{"$f":"'照明灯台帳 別紙8-1'!AN9","v":0},{"$f":"'照明灯台帳 別紙8-1'!AO9","v":0},{"$f":"'照明灯台帳 別紙8-1'!AP9","v":0},{"$f":"'照明灯台帳 別紙8-1'!AQ9","v":0},{"$f":"'照明灯台帳 別紙8-1'!AR9","v":0},{"$f":"'照明灯台帳 別紙8-1'!AS9","v":0},{"$f":"'照明灯台帳 別紙8-1'!AT9","v":0},{"$f":"'照明灯台帳 別紙8-1'!AU9","v":0},{"$f":"'照明灯台帳 別紙8-1'!AV9","v":0},{"$f":"'照明灯台帳 別紙8-1'!AW9","v":0},{"$f":"'照明灯台帳 別紙8-1'!AX9","v":0},{"$f":"'照明灯台帳 別紙8-1'!AY9","v":0},{"$f":"'照明灯台帳 別紙8-1'!AZ9","v":0},{"$f":"'照明灯台帳 別紙8-1'!BA9","v":0},{"$f":"'照明灯台帳 別紙8-1'!BB9","v":0},{"$f":"'照明灯台帳 別紙8-1'!BC9","v":0},{"$f":"'照明灯台帳 別紙8-1'!BD9","v":0},null,null,null,null,{"$f":"'照明灯台帳 別紙8-1'!BI9","v":0}]
[null,null,null,null,null,null,null,null,null,null,null,null,{"$f":"'照明灯台帳 別紙8-1'!M10","v":0},{"$f":"'照明灯台帳 別紙8-1'!N10","v":0},{"$f":"'照明灯台帳 別紙8-1'!O10","v":0},{"$f":"'照明灯台帳 別紙8-1'!P10","v":0},{"$f":"'照明灯台帳 別紙8-1'!Q10","v":0},{"$f":"'照明灯台帳 別紙8-1'!R10","v":0},{"$f":"'照明灯台帳 別紙8-1'!S10","v":0},{"$f":"'照明灯台帳 別紙8-1'!T10","v":0},{"$f":"'照明灯台帳 別紙8-1'!U10","v":0},{"$f":"'照明灯台帳 別紙8-1'!V10","v":0},{"$f":"'照明灯台帳 別紙8-1'!W10","v":0},{"$f":"'照明灯台帳 別紙8-1'!X10","v":0},{"$f":"'照明灯台帳 別紙8-1'!Y10","v":0},{"$f":"'照明灯台帳 別紙8-1'!Z10","v":0},{"$f":"'照明灯台帳 別紙8-1'!AA10","v":0},{"$f":"'照明灯台帳 別紙8-1'!AB10","v":0},{"$f":"'照明灯台帳 別紙8-1'!AC10","v":0},{"$f":"'照明灯台帳 別紙8-1'!AD10","v":0},{"$f":"'照明灯台帳 別紙8-1'!AE10","v":0},{"$f":"'照明灯台帳 別紙8-1'!AF10","v":0},{"$f":"'照明灯台帳 別紙8-1'!AG10","v":0},{"$f":"'照明灯台帳 別紙8-1'!AH10","v":0},{"$f":"'照明灯台帳 別紙8-1'!AI10","v":0},{"$f":"'照明灯台帳 別紙8-1'!AJ10","v":0},{"$f":"'照明灯台帳 別紙8-1'!AK10","v":0},{"$f":"'照明灯台帳 別紙8-1'!AL10","v":0},{"$f":"'照明灯台帳 別紙8-1'!AM10","v":0},{"$f":"'照明灯台帳 別紙8-1'!AN10","v":0},{"$f":"'照明灯台帳 別紙8-1'!AO10","v":0},{"$f":"'照明灯台帳 別紙8-1'!AP10","v":0},{"$f":"'照明灯台帳 別紙8-1'!AQ10","v":0},{"$f":"'照明灯台帳 別紙8-1'!AR10","v":0},{"$f":"'照明灯台帳 別紙8-1'!AS10","v":0},{"$f":"'照明灯台帳 別紙8-1'!AT10","v":0},{"$f":"'照明灯台帳 別紙8-1'!AU10","v":0},{"$f":"'照明灯台帳 別紙8-1'!AV10","v":0},{"$f":"'照明灯台帳 別紙8-1'!AW10","v":0},{"$f":"'照明灯台帳 別紙8-1'!AX10","v":0},{"$f":"'照明灯台帳 別紙8-1'!AY10","v":0},{"$f":"'照明灯台帳 別紙8-1'!AZ10","v":0},{"$f":"'照明灯台帳 別紙8-1'!BA10","v":0},{"$f":"'照明灯台帳 別紙8-1'!BB10","v":0},{"$f":"'照明灯台帳 別紙8-1'!BC10","v":0},{"$f":"'照明灯台帳 別紙8-1'!BD10","v":0},null,null,null,null,{"$f":"'照明灯台帳 別紙8-1'!BI10","v":0}]
{"$rows_left_out":35}